{"text_format":"1","workbook":"xlsx","n_sheets":10,"sheets":["PartA","PartB","Director Attestation","FDC Instructions","Common Findings","Definitions","Show_Hide Notes","ExportA","ExportB","Drop-down"],"not_rendered":{"charts":0,"images":2,"macros":1,"external_links":0,"defined_names":2,"comments":0,"pivot_tables":0},"unopened":[],"bounds":{"document_bytes":16777216,"sheet_cells":100000,"rows_first":2000,"rows_last":500,"rows_between":2000,"halvings":0,"cell_chars":16384,"cell_head_chars":4096},"cells_cut":0,"cells_raw":0,"read":"whole","date_system":"1900"}

{"sheet":"PartA","index":0,"n_rows":666,"n_cols":3,"rows_kept":666,"cut":false,"hidden":false,"merged":[[590,2,595,2],[606,2,611,2],[629,2,637,2],[647,2,650,2],[358,2,359,2],[366,2,368,2],[665,0,666,2],[392,2,393,2],[460,2,461,2],[464,2,465,2],[471,2,472,2],[488,2,491,2],[412,0,413,2],[416,0,416,2],[417,2,418,2],[447,2,449,2],[518,2,520,2],[493,2,494,2],[497,2,498,2],[663,2,664,2],[422,2,423,2],[441,2,443,2],[401,2,404,2],[659,2,660,2],[574,2,575,2],[569,0,570,2],[654,0,654,2],[90,2,92,2],[94,2,97,2],[103,1,103,2],[655,2,658,2],[573,0,573,2],[381,1,381,2],[424,2,425,2],[428,2,431,2],[293,0,293,2],[311,2,313,2],[135,1,135,2],[136,2,137,2],[141,2,142,2],[138,2,139,2],[193,1,193,2],[194,2,195,2],[182,2,183,2],[144,2,145,2],[154,2,155,2],[576,2,581,2],[159,2,163,2],[164,2,166,2],[167,2,172,2],[203,2,205,2],[220,2,223,2],[104,2,105,2],[107,2,108,2],[111,2,112,2],[122,2,123,2],[188,2,191,2],[197,2,201,2],[130,0,131,2],[114,2,116,2],[127,2,128,2],[118,2,120,2],[134,0,134,2],[216,2,219,2],[19,1,19,2],[56,2,58,2],[63,2,65,2],[77,2,78,2],[80,2,83,2],[22,2,23,2],[26,2,27,2],[29,2,31,2],[99,2,101,2],[50,0,50,2],[51,0,51,2],[34,2,35,2],[47,0,48,2],[60,2,61,2],[67,2,70,2],[72,2,73,2],[44,2,45,2],[55,1,55,2],[85,2,87,2],[89,1,89,2],[75,2,76,2],[5,0,6,2],[8,0,8,2],[13,2,16,2],[10,0,10,2],[11,0,11,2],[12,0,12,2],[25,1,25,2],[653,0,653,2],[252,2,253,2],[254,2,255,2],[557,2,558,2],[320,2,321,2],[485,2,486,2],[387,2,390,2],[362,2,363,2],[371,2,373,2],[361,1,361,2],[419,2,420,2],[407,1,407,2],[451,2,452,2],[560,2,562,2],[564,2,565,2],[276,2,277,2],[317,2,318,2],[408,1,409,2],[522,1,523,2],[588,2,589,2],[596,2,597,2],[645,2,646,2],[638,2,639,2],[395,2,396,2],[505,2,506,2],[510,2,511,2],[515,2,516,2],[530,2,531,2],[617,2,618,2],[473,1,473,2],[477,1,477,2],[481,1,481,2],[543,2,544,2],[532,2,535,2],[572,0,572,2],[507,2,509,2],[545,2,546,2],[433,2,434,2],[438,2,439,2],[399,1,399,2],[501,2,502,2],[245,2,248,2],[262,2,264,2],[278,2,280,2],[175,1,175,2],[178,2,179,2],[307,2,309,2],[304,2,305,2],[285,2,286,2],[289,0,290,2],[292,0,292,2],[237,2,238,2],[212,2,214,2],[228,2,230,2],[232,1,233,2],[207,2,210,2],[185,2,186,2],[234,2,235,2],[226,2,227,2],[250,2,251,2],[240,2,243,2],[661,2,662,2],[585,2,587,2],[582,2,584,2],[598,2,604,2],[613,2,616,2],[619,2,627,2],[640,2,644,2],[651,0,651,2],[152,2,153,2],[283,2,284,2],[256,2,259,2],[270,2,271,2],[273,2,274,2],[268,2,269,2],[176,1,177,2],[332,2,334,2],[330,1,330,2],[300,2,301,2],[294,2,297,2],[298,2,299,2],[336,2,337,2],[348,2,349,2],[322,1,324,2],[325,1,325,2]]}
["Date:"]
["Facility:",null,"Select Facility…"]
["Facility Contact:"]
["Facility Email:"]
[]
["Submission of this form should occur no later than July 31, 2023.  If updated information becomes available after July 31, 2023, please contact ORO at OROIDA@va.gov. "]
[]
[]
["PART A - CHECKLIST OF RESEARCH - RELATED REQUIREMENTS"]
[]
["Medical Facility Director - Institutional Responsibilities"]
["Questions shaded in yellow are new questions from previous FDC versions."]
["Questions shaded in orange are related to Common Findings on ORO Combined Program Reviews. Clicking on the \"More Info\" button for these items will navigate to ORO's Common Findings List."]
["1.","Select…","Are there adequate resources and administrative support, including personnel, space, equipment, and training for the Research and Development Committee (R&DC) and its subcommittees to fulfill their responsibilities? If “No,” please provide comments in the space below."]
[]
{"$rows_left_out":652}
{"sheet":"PartB","index":1,"n_rows":533,"n_cols":3,"rows_kept":533,"cut":false,"hidden":false,"merged":[[372,2,377,2],[410,1,413,1],[425,1,427,1],[172,1,175,1],[344,2,350,2],[345,1,346,1],[347,1,349,1],[218,1,219,1],[14,1,15,1],[281,1,282,1],[157,1,159,1],[180,0,180,2],[185,2,188,2],[205,2,208,2],[241,1,242,1],[243,1,244,1],[357,0,357,2],[358,0,358,2],[371,1,372,1],[373,1,374,1],[319,1,320,1],[328,1,329,1],[338,1,339,1],[301,2,302,2],[532,0,532,2],[444,0,444,2],[378,0,378,2],[379,0,379,2],[387,1,388,1],[288,1,289,1],[250,1,251,1],[255,1,256,1],[528,1,530,1],[503,1,506,1],[324,1,326,1],[332,1,333,1],[353,1,354,1],[359,1,360,1],[361,0,362,2],[364,1,366,1],[522,1,523,1],[365,2,370,2],[295,2,296,2],[305,1,306,1],[305,2,306,2],[308,1,309,1],[257,1,258,1],[300,1,302,1],[111,2,112,2],[55,1,56,1],[72,0,72,2],[73,0,73,2],[61,1,62,1],[57,1,60,1],[64,1,65,1],[66,1,68,1],[69,1,70,1],[74,0,78,2],[99,1,100,1],[95,1,96,1],[91,1,92,1],[84,1,85,1],[111,1,112,1],[97,1,98,1],[56,2,63,2],[81,2,82,2],[0,0,0,2],[1,0,1,2],[3,0,3,2],[4,0,4,2],[5,0,5,2],[6,0,6,2],[52,1,53,1],[7,0,8,2],[22,0,23,2],[25,1,27,1],[40,1,41,1],[25,2,30,2],[40,2,41,2],[47,2,54,2],[50,1,51,1],[46,1,49,1],[12,1,13,1],[37,1,38,1],[16,1,18,1],[9,1,11,1],[20,0,20,2],[21,0,21,2],[10,2,13,2],[15,2,19,2],[523,2,524,2],[527,2,531,2],[223,2,225,2],[241,2,245,2],[249,2,252,2],[254,2,259,2],[285,2,286,2],[288,2,293,2],[297,2,299,2],[496,2,497,2],[410,2,414,2],[478,2,480,2],[487,2,489,2],[388,2,392,2],[355,0,355,2],[380,1,381,1],[394,2,399,2],[400,2,401,2],[375,1,376,1],[422,1,423,1],[423,2,428,2],[367,1,369,1],[340,1,342,1],[334,1,336,1],[121,1,123,1],[138,1,140,1],[132,1,134,1],[150,1,151,1],[114,2,116,2],[118,2,120,2],[161,1,162,1],[176,0,176,2],[163,1,166,1],[162,2,166,2],[154,1,155,1],[151,2,152,2],[147,1,148,1],[121,2,124,2],[155,2,160,2],[131,2,135,2],[137,2,141,2],[125,1,126,1],[513,2,519,2],[503,2,507,2],[456,1,458,1],[462,1,463,1],[179,0,179,2],[103,1,104,1],[106,1,107,1],[181,1,182,1],[189,1,190,1],[199,1,200,1],[202,1,203,1],[234,1,235,1],[228,1,229,1],[230,1,231,1],[232,1,233,1],[211,2,214,2],[217,2,220,2],[216,1,217,1],[184,1,185,1],[210,1,211,1],[186,1,187,1],[114,1,116,1],[118,1,120,1],[253,1,254,1],[441,0,441,2],[443,0,443,2],[450,1,451,1],[447,0,448,2],[383,1,384,1],[420,1,421,1],[400,1,401,1],[461,2,467,2],[469,0,469,2],[468,0,468,2],[431,1,432,1],[435,1,436,1],[437,1,439,1],[432,2,433,2],[436,2,440,2],[396,1,398,1],[429,1,430,1],[394,1,395,1],[452,1,455,1],[460,1,461,1],[464,1,466,1],[453,2,459,2],[205,1,207,1],[212,1,213,1],[260,1,261,1],[223,1,224,1],[329,2,330,2],[332,2,337,2],[339,2,342,2],[308,2,309,2],[352,2,354,2],[310,1,311,1],[314,1,315,1],[351,1,352,1],[343,1,344,1],[311,2,316,2],[320,2,321,2],[323,2,327,2],[317,1,318,1],[271,1,272,1],[273,1,274,1],[303,1,304,1],[275,2,278,2],[275,1,277,1],[472,1,473,1],[479,1,480,1],[481,1,483,1],[490,0,492,0],[490,1,491,1],[526,1,527,1],[265,1,266,1],[267,1,268,1],[295,1,296,1],[520,1,521,1],[495,1,496,1],[486,1,487,1],[513,1,514,1],[515,1,518,1],[488,1,489,1],[508,1,509,1],[312,1,313,1],[477,1,478,1],[285,1,286,1],[297,1,298,1],[390,1,391,1],[290,1,292,1],[470,1,471,1],[445,0,446,2]]}
[{"$f":"PartA!C2","v":"Select Facility…"}]
["PART B - RESEARCH PROGRAM QUANTITATIVE DATA"]
[]
["All questions in Part B refer to reporting period June 1, 2022 to May 31, 2023"]
[]
["RESEARCH AND DEVELOPMENT PROGRAM AND R&DC"]
["Note: Questions shaded in yellow are new questions from previous FDC versions."]
["Note: Questions #1 to 1a are not based on RCO audits and pertain only to events occurring during the current reporting period. These questions may be best addressed by the Research Service."]
[]
["1. ","Number of protocols followed only by the R&DC at any time during this reporting period (e.g., IRB-exempt human subjects protocols; protocols without human, animal, or safety hazards not followed by any research subcommittee):"]
[]
[]
[null,"Only include protocols that are solely followed by the R&DC and not followed by any other oversight committee (including any external IRBs)."]
[]
[null,"a.  Number in #1 that were NOT initially approved by the R&DC before research was initiated:"]
{"$rows_left_out":519}
{"sheet":"Director Attestation","index":2,"n_rows":18,"n_cols":1,"rows_kept":18,"cut":false,"hidden":false,"merged":[[0,0,0,9],[2,0,2,2],[3,0,4,9],[6,0,7,9],[17,0,17,3],[17,4,17,9],[13,0,14,9],[9,0,9,9],[10,0,10,9],[11,0,11,9],[12,0,12,9],[1,0,1,9]]}
[{"$f":"PartA!C2","v":"Select Facility…"}]
["Facility Director Attestation"]
[]
["I acknowledge that I am the Director of this VHA Facility and the Institutional Official responsible for this Facility’s compliance with all federal, VA, and VHA research requirements.  "]
[]
[]
["By submitting this document, I certify that the information contained in this document is accurate to the best of my knowledge."]
[]
[]
["Complete the following steps to submit this Certification:"]
["1. Type your name in the \"Name of the Medical Facility Director\" text box highlighted below."]
["2. Save the file by clicking the \"Save File\" button below."]
["3. Click the \"Email File\" button to attach this file to an email."]
["4. In the body of the email, please update \"[Insert Station Number and/or Facility Name] \" with your facility's station number and/or facility name and send the email."]
[]
{"$rows_left_out":4}
{"sheet":"FDC Instructions","index":3,"n_rows":106,"n_cols":1,"rows_kept":106,"cut":false,"hidden":false,"merged":[[2,0,3,9],[18,0,18,9],[27,0,27,9],[10,0,10,9],[12,0,13,9],[22,0,22,9],[7,0,8,9],[5,0,5,9],[87,0,89,9],[105,0,105,9],[93,0,93,9],[95,0,96,9],[98,0,99,9],[101,0,101,9],[63,0,64,9],[15,0,16,9],[81,0,82,9],[84,0,85,9],[24,0,25,9],[68,0,71,9],[20,0,20,9],[50,0,52,9],[31,0,31,9],[45,0,48,9],[54,0,56,9],[58,0,61,9],[73,0,75,9],[77,0,79,9],[41,0,43,9],[33,0,39,9]]}
["GENERAL INSTRUCTIONS"]
[]
["1. Complete and submit the 2023 Facility Director’s Certification of Research Oversight (FDC) in MS Excel format.  "]
[]
[]
["2. Open the Excel tool in the MS Excel application. Do not open the tool through MS Teams or OneDrive."]
[]
["3. Save the tool as a macro-enabled workbook (.xlsm) so all functions work as intended. The tool has built-in logic to hide or gray out certain questions and rows depending on the answers to other questions. "]
[]
[]
["4. Include your facility's name in the file name of the saved document."]
[]
["5. Adjust how zoomed in or out you are on the screen as needed if an item appears to be truncated. All items are formatted to be fully visible, but appearances may differ by screen. "]
[]
[]
{"$rows_left_out":92}
{"sheet":"Common Findings","index":4,"n_rows":275,"n_cols":1,"rows_kept":275,"cut":false,"hidden":false,"merged":[]}
["The Common Findings Tab lists recurring findings of programmatic noncompliance captured in ORO combined program review (CPR) reports issued in calendar years 2020 through 2022. \"Common Findings\" are those findings identified at 20% or more of the programs reviewed across the combined 3-year period (2020-2022). The numbered items (shaded in orange) list the Common Findings. The bulleted points below each listed Common Finding provide representative examples of that finding from the CPR reports. Red font denotes that the description of the finding aligns with a specific question on the FDC. \n\nIn the Part A Tab, FDC items related to a Common Findings are shaded in orange with a black border to provide information about which FDC questions correspond with the Common Findings. Information about the Common Findings from CPRs has been added to the FDC to bring awareness to the nature of the noncompliance ORO regularly finds during site visits. By raising awareness of these Common Findings, ORO hopes to try to reduce the occurrence of that noncompliance."]
[]
["Common Findings Related to General Research Administration"]
["1. Deficient R&DC Review / Approval of Research "]
["• All applicable committee reviews and approvals did not occur prior to R&DC approval and notification of permission to initiate the research, to include:"]
["◦ Final IRB approval was not secured prior to final R&DC approval."]
["◦ VA-approved laboratory studies were reviewed and approved by the R&DC prior to the SRS and IBC approvals required by the proposed research."]
["◦ Privacy Officer (PO) reviews were not completed prior to final R&DC approval."]
["◦ Information System Security Officer (ISSO) reviews were not completed prior to final R&DC approval. "]
["• The R&DC reviewed and approved VA research at convened meetings without a quorum present."]
["• Final approvals by Designated Member Review (DMR) were not reported to the full R&DC at the next convened meeting, as required by VHA policy. "]
["• The R&DC did not approve amendments to approved research for which it was the only oversight committee."]
["• Final approval contingent upon completion of the ISSO review was at times granted administratively by the R&DC coordinator rather than by the convened R&DC, R&DC Chair, or by DMR. "]
["• The R&DC did not document all required determinations for studies overseen by an external IRB."]
["• The R&DC reviewed and approved non-VA research that did not qualify as VA research based on the misunderstanding that such “approval” was required for purposes of Research and Development Information System (RDIS) reporting. "]
{"$rows_left_out":261}
{"sheet":"Definitions","index":5,"n_rows":6,"n_cols":1,"rows_kept":6,"cut":false,"hidden":false,"merged":[]}
["DEFINITIONS"]
["VHA Handbook 1108.04 §2.q."]
["q. Investigational Drug. An investigational drug is a chemical or biological drug that is used in a clinical investigation. \n(1) An investigational drug can be:\n(a) A new chemical compound, which has not been approved by the FDA, or \n(b) An approved drug that is being studied for an approved or unapproved use, dose, dosage form, administration schedule, or under an IND application, in a clinical investigation. This includes: prescription drugs, over-the-counter drugs, nutritional supplements, herbal preparations, and legend items used for the diagnosis, treatment, cure, mitigation or prevention of disease and meeting the above definition. "]
[]
["21 CFR 812.3(m)"]
["(m) Significant risk device means an investigational device that:\n(1) Is intended as an implant and presents a potential for serious risk to the health, safety, or welfare of a subject;\n(2) Is purported or represented to be for a use in supporting or sustaining human life and presents a potential for serious risk to the health, safety, or welfare of a subject;\n(3) Is for a use of substantial importance in diagnosing, curing, mitigating, or treating disease, or otherwise preventing impairment of human health and presents a potential for serious risk to the health, safety, or welfare of a subject; or\n(4) Otherwise presents a potential for serious risk to the health, safety, or welfare of a subject."]

{"sheet":"Show_Hide Notes","index":6,"n_rows":41,"n_cols":10,"rows_kept":41,"cut":false,"hidden":true,"merged":[]}
[null,"Question Number","Target Cell","Target Rows","Comments"]
["R&DC of another facility = YES",5,"B53","56:85","Collapse R&DC question","Grayed out cell and font",null,null,null,"Border color"]
["Broad consent = NO",15,"B226","227:232","Collapse broad consent questions","#808080",null,null,null,"#D0CECE"]
["Investigational Drugs = NO",18,"B251","253:276","Collapse investigational drug questions"]
["Controlled substances = NO","18f","B269","271:276","Collapse controlled substance questions"]
["Investigational Devices = NO",19,"B277","279:285","Collapse investigational device questions"]
["Animal Program = NO",21,"B295","299:415","Collapse entire section"]
["Animal Program = NO",21,"B295","Part B 352:436","Collapse PART B animal section"]
["Internal IACUC-of-record = YES",22,"B299","308:317","Collapse affiliate IACUC questions"]
["Internal IACUC-of-record = NO",22,"B299","301:307","Collapse VA IACUC questions"]
["Affiliate IACUC-of-record = YES",23,"B308","318:322","Collapse ADDITIONAL affiliate IACUC questions"]
["Animals Housed = Only at the VA animal facility",27,"B332","408:412","Collapse affiliate facility question (33)"]
["Animals Housed =  Only at the affiliate animal facility",27,"C332","362:381","Collapse VA animal facility question (30)"]
["Animals Housed =  Only at the affiliate animal facility",27,"C332","400:407","Collapse VA vet services question (31)"]
["SRS Waiver = YES","34a","B420","423:572","Collapse safety section"]
{"$rows_left_out":27}
{"sheet":"ExportA","index":7,"n_rows":225,"n_cols":6,"rows_kept":225,"cut":false,"hidden":true,"merged":[]}
["Question#","QuestionText","id-facility","id-question","FDCdate","FDCresult"]
["1","Adequate Resources",{"$f":"LEFT(PartA!C2,FIND(\" \",PartA!C2,1)-1)","v":"Select"},"FD2","2023-07-31",{"$f":"PartA!B14","v":"Select…"}]
["1_detail","DETAILS Adequate Resources",{"$f":"C2","v":"Select"},"FD20","2023-07-31",{"$f":"IF(PartA!C18=\"\",\"\",PartA!C18)","v":""}]
["2a","R&DC Appointed in Writing","Select","FD9","2023-07-31",{"$f":"PartA!B21","v":"Select…"}]
["2b","Delegated Roles","Select","FD1","2023-07-31",{"$f":"PartA!B23","v":"Select…"}]
["3a","RCO Audit Plan","Select","FD6","2023-07-31",{"$f":"PartA!B27","v":"Select…"}]
["3b","Audits Completed","Select","FD7","2023-07-31",{"$f":"PartA!$B$30","v":"Select…"}]
["3b_detail","DETAILS Audits Not Completed","Select","FD11","2023-07-31",{"$f":"IF(PartA!C34=\"\",\"\",PartA!C34)","v":""}]
["4","Any Acting Position(s)","Select","FD3","2023-07-31",{"$f":"PartA!B35","v":"Select…"}]
["4_acting_detail","DETAILS Acting Positions","Select","FD21","2023-07-31",{"$f":"IF(PartA!C44=\"\",\"\",PartA!C44)","v":""}]
["4_FD","Acting Facility Director","Select","FD12","2023-07-31",false]
["4_ACOS","Acting ACOS/Research or Coordinator","Select","FD14","2023-07-31",false]
["4_AO","Acting Administrative Officer/Research","Select","FD15","2023-07-31",false]
["4_RCO","Acting Research Compliance Officer","Select","FD16","2023-07-31",false]
["4_CC","Acting Research Committee Coordinator(s)","Select","FD17","2023-07-31",false]
{"$rows_left_out":211}
{"sheet":"ExportB","index":8,"n_rows":182,"n_cols":8,"rows_kept":182,"cut":false,"hidden":true,"merged":[]}
["Question#","QuestionText","id-facility","id-question","ROC_QuestionKey","FDCdate","FDCresult","FDCdetail"]
["1","Total number of protocols followed by the R&DC only",{"$f":"LEFT(PartA!C2,FIND(\" \",PartA!C2,1)-1)","v":"Select"},1,"R1","2023-07-31",{"$f":"IF(PartB!C10=\"\",\"\",PartB!C10)","v":""}]
["1a","Protocols initiated prior to R&DC approval",{"$f":"C2","v":"Select"},2,"R2","2023-07-31",{"$f":"IF(PartB!C15=\"\",\"\",PartB!C15)","v":""}]
["1aDetails","DETAILS Protocols initiated prior to R&DC approval",{"$f":"C3","v":"Select"},147,"R5","2023-07-31",null,{"$f":"IF(PartB!B20=\"\",\"\",PartB!B20)","v":""}]
["2","Active human protocols","Select",5,"H1","2023-07-31",{"$f":"IF(PartB!C25=\"\",\"\",PartB!C25)","v":""}]
["MVP","DETAILS MVP active at site","Select",155,"H82","2023-07-31",null,false]
["AllOfUs","DETAILS All of Us active at site","Select",187,"H123","2023-07-31",null,false]
["3a","IRB-exempt human subjects protocols","Select",6,"H2","2023-07-31",{"$f":"IF(PartB!C32=\"\",\"\",PartB!C32)","v":""}]
["3b","Non-exempt human subjects protocols","Select",7,"H3","2023-07-31",{"$f":"IF(PartB!C33=\"\",\"\",PartB!C33)","v":""}]
["4","Greater than minimal risk protocols","Select",129,"H72","2023-07-31",{"$f":"IF(PartB!C35=\"\",\"\",PartB!C35)","v":""}]
["5a","Protocols with waivers of informed consent per 38CFR16.116","Select",9,"H5","2023-07-31",{"$f":"IF(PartB!C37=\"\",\"\",PartB!C37)","v":""}]
["5b","Protocols with waiver of documentation of informed consent per 38CFR16.117(c)","Select",8,"H4","2023-07-31",{"$f":"IF(PartB!C40=\"\",\"\",PartB!C40)","v":""}]
["6a","Protocols subject to 2018 Common Rule","Select",249,"H146","2023-07-31",{"$f":"IF(PartB!C44=\"\",\"\",PartB!C44)","v":""}]
["6b","Protocols subject to Pre-2018 Common Rule","Select",250,"H147","2023-07-31",{"$f":"IF(PartB!C45=\"\",\"\",PartB!C45)","v":""}]
["7","Protocols suspended/terminated early by IRB","Select",212,"H124","2023-07-31",{"$f":"IF(PartB!C47=\"\",\"\",PartB!C47)","v":""}]
{"$rows_left_out":168}
{"sheet":"Drop-down","index":9,"n_rows":111,"n_cols":32,"rows_kept":111,"cut":false,"hidden":true,"merged":[[23,30,23,31],[24,30,25,31]]}
["VISN","Facility #","Facility","Select Facility…",null,"Select…",null,"Select…",null,"Select…",null,"Select…",null,"Select…",null,"Select…",null,"Select…",null,"Select…",null,"Select…",null,"Select…"]
[1,402,"VA Maine Healthcare System - Togus","402 VA Maine Healthcare System - Togus",null,"Yes",null,"Yes",null,"Continued full accreditation",null,"Only at the VA animal facility",null,"Full-time",null,"A full-time VA employed veterinarian",null,"The VA IACUC performs the program review and facility inspection of the VA animal program.",null,"The VA IACUC performs its own program review and facility inspection of the affiliate(s) animal program.",null,0,null,"The IBC is a separate committee from the SRS. "]
[1,405,"White River Junction VA Medical Center","405 White River Junction VA Medical Center",null,"No",null,"No",null,"Conditional accreditation",null,"Only at the affiliate animal facility",null,"Part-time",null,"A part-time VA employed veterinarian",null,"The affiliate IACUC-of-record (i.e., no VA IACUC) performs the program review and facility inspection of the VA animal program.",null,"The VA IACUC accepts the semi-annual reports of the affiliate IACUC (in lieu of performing its own facility inspection and program review) as a business item during a convened meeting.",null,"1-10",null,"The SRS is constituted as an IBC, and convenes as an IBC/SRS (a single set of minutes are produced)."]
[23,437,"Fargo VA Health Care System","437 Fargo VA Health Care System",null,"N/A",null,null,null,"Deferred accreditation",null,"Both at the VA and affiliate animal facility",null,null,null,"A full-time contracted veterinarian",null,null,null,"The affiliate IACUC-of-record (i.e., no VA IACUC) performs the program review and facility inspection of the VA animal program",null,"11-20",null,"The SRS is constituted as an IBC, but separate IBC and SRS meetings are convened (two sets of minutes are produced)."]
[23,438,"Sioux Falls VA Health Care System","438 Sioux Falls VA Health Care System",null,null,null,null,null,"Probation",null,null,null,null,null,"A part-time contracted veterinarian",null,null,null,null,null,"21-30"]
[21,459,"VA Pacific Islands Health Care System","459 VA Pacific Islands Health Care System",null,null,null,null,null,"Revoked accreditation",null,null,null,null,null,null,null,null,null,null,null,"31-40"]
[4,460,"Wilmington VA Medical Center","460 Wilmington VA Medical Center",null,null,null,null,null,null,null,null,null,null,null,null,null,null,null,null,null,">40"]
[22,501,"New Mexico VA Health Care System","501 New Mexico VA Health Care System"]
[10,506,"VA Ann Arbor Healthcare System","506 VA Ann Arbor Healthcare System"]
[7,508,"Atlanta VA Medical Center","508 Atlanta VA Medical Center"]
[7,509,"Charlie Norwood VA Medical Center","509 Charlie Norwood VA Medical Center"]
[5,512,"VA Maryland Health Care System","512 VA Maryland Health Care System"]
[10,515,"Battle Creek VA Medical Center","515 Battle Creek VA Medical Center"]
[8,516,"Bay Pines VA Healthcare System","516 Bay Pines VA Healthcare System"]
[1,518,"Edith Nourse Rogers Memorial VA Hospital","518 Edith Nourse Rogers Memorial VA Hospital"]
{"$rows_left_out":96}