{"text_format":"1","workbook":"xlsx","n_sheets":7,"sheets":["PartA","PartB","Director Attestation","FDC Instructions","ExportA","ExportB","Drop-down"],"not_rendered":{"charts":0,"images":2,"macros":1,"external_links":0,"defined_names":0,"comments":0,"pivot_tables":0},"unopened":[],"bounds":{"document_bytes":16777216,"sheet_cells":100000,"rows_first":2000,"rows_last":500,"rows_between":2000,"halvings":0,"cell_chars":16384,"cell_head_chars":4096},"cells_cut":0,"cells_raw":0,"read":"whole","date_system":"1900"}

{"sheet":"PartA","index":0,"n_rows":582,"n_cols":3,"rows_kept":582,"cut":false,"hidden":false,"merged":[[581,0,582,2],[368,2,369,2],[437,2,438,2],[441,2,442,2],[448,2,449,2],[465,2,468,2],[389,0,390,2],[393,0,393,2],[394,2,395,2],[424,2,426,2],[496,2,498,2],[470,2,471,2],[474,2,475,2],[579,2,580,2],[399,2,400,2],[418,2,420,2],[378,2,381,2],[478,2,479,2],[576,2,577,2],[541,2,542,2],[536,0,537,2],[539,0,539,2],[571,0,571,2],[572,2,575,2],[76,2,78,2],[540,0,540,2],[138,1,138,2],[139,2,140,2],[124,0,125,2],[108,2,110,2],[376,1,376,2],[121,2,122,2],[356,1,356,2],[401,2,402,2],[405,2,408,2],[410,2,411,2],[415,2,416,2],[301,1,303,2],[304,1,304,2],[160,2,162,2],[165,2,167,2],[168,2,171,2],[174,2,176,2],[102,2,103,2],[233,2,234,2],[211,2,213,2],[216,1,217,2],[220,2,221,2],[223,2,226,2],[201,2,203,2],[105,2,106,2],[112,2,114,2],[195,2,199,2],[204,2,208,2],[22,2,23,2],[26,2,27,2],[29,2,31,2],[144,2,145,2],[178,2,179,2],[180,2,182,2],[94,2,96,2],[49,0,49,2],[50,0,50,2],[55,2,56,2],[33,2,34,2],[46,0,47,2],[58,2,59,2],[61,2,62,2],[64,2,67,2],[69,2,70,2],[43,2,44,2],[54,1,54,2],[19,1,19,2],[5,0,6,2],[8,0,8,2],[13,2,16,2],[10,0,10,2],[11,0,11,2],[12,0,12,2],[25,1,25,2],[570,0,570,2],[235,2,236,2],[237,2,238,2],[524,2,525,2],[299,2,300,2],[462,2,463,2],[363,2,366,2],[342,2,343,2],[345,2,346,2],[348,2,350,2],[341,1,341,2],[396,2,397,2],[384,1,384,2],[428,2,429,2],[527,2,529,2],[531,2,532,2],[258,2,259,2],[264,2,265,2],[544,2,545,2],[557,2,558,2],[450,1,450,2],[454,1,454,2],[458,1,458,2],[521,2,522,2],[268,0,269,2],[271,0,271,2],[313,2,314,2],[325,2,326,2],[487,2,489,2],[490,2,491,2],[493,2,494,2],[508,2,509,2],[510,2,513,2],[272,0,272,2],[290,2,292,2],[296,2,297,2],[286,2,288,2],[283,2,284,2],[309,2,311,2],[337,1,337,2],[245,2,246,2],[261,2,262,2],[228,2,231,2],[80,2,82,2],[84,1,84,2],[85,2,87,2],[89,2,92,2],[98,1,98,2],[99,2,100,2],[147,2,149,2],[190,2,191,2],[116,2,117,2],[128,0,128,2],[129,1,129,2],[130,2,131,2],[135,2,136,2],[132,2,133,2],[151,1,151,2],[152,2,153,2],[155,2,158,2],[239,2,242,2],[252,2,253,2],[255,2,256,2],[250,2,251,2],[279,2,280,2],[273,2,276,2],[277,2,278,2],[568,0,568,2],[339,0,340,2],[385,1,386,2],[500,1,501,2],[547,2,548,2],[550,2,551,2],[565,2,566,2],[562,2,563,2],[482,2,483,2],[371,2,372,2],[485,2,486,2]]}
["Date:"]
["Facility:",null,"Select Facility…"]
["Facility Contact:"]
["Facility Email:"]
[]
["Submission of this form should occur no later than August 1, 2022.  If updated information becomes available after August 1, 2022 please contact ORO at OROIDA@va.gov. "]
[]
[]
["PART A - CHECKLIST OF RESEARCH -RELATED REQUIREMENTS"]
[]
["Medical Facility Director - Institutional Responsibilities"]
["Questions shaded in yellow are new questions from previous FDC versions."]
["Questions with an orange border are related to common findings on ORO Combined Program Reviews."]
["1.","Select…","Are there adequate resources and administrative support, including personnel, space, equipment, and training for the Research and Development Committee (R&DC) and its subcommittees to fulfill their responsibilities? If “No,” please provide comments in the space below."]
[]
[]
[]
[]
[null,null,"VHA Directive 1200.01(1) §5.f(6); VHA Directive 1200.02(1) §11.e(2)-(3)"]
["2.","Has the Medical Facility Director:"]
[null,"Select…","a.  Appointed members of the R&DC and its subcommittees in writing? "]
[null,null,"VHA Directive 1200.01(1) §5.f(3)"]
[null,"Select…","b.  Delegated authority in writing for the roles and responsibilities within the facility’s Human Research Protection Program (HRPP)?"]
[]
[null,null,"VHA Directive 1200.05(2) §5.f(2)(c)"]
["3. ","Has the Research Compliance Officer (RCO):"]
[" ","Select…","a.  Maintained auditing plans and/or standard operation procedures (SOPs) for accomplishing required RCO informed consent audits and regulatory audits?\n\nVHA Directive 1058.01 §5.i(1)  "]
[]
[null,null,"VHA Directive 1058.01 §5.i(1) "]
[null,"Select…","b.  Completed all required annual informed consent and triennial regulatory audits for this reporting period? If “No,” please provide details in the space below. Include audit type(s) and number of audits to be completed. "]
{"$rows_left_out":553}
{"sheet":"PartB","index":1,"n_rows":425,"n_cols":3,"rows_kept":425,"cut":false,"hidden":false,"merged":[[403,1,404,1],[369,2,374,2],[191,1,192,1],[193,1,194,1],[210,1,211,1],[424,0,424,2],[353,0,353,2],[300,0,300,2],[301,0,301,2],[306,1,307,1],[216,1,217,1],[200,1,201,1],[205,1,206,1],[421,1,422,1],[399,1,401,1],[253,1,254,1],[260,1,261,1],[271,1,272,1],[281,1,282,1],[283,0,284,2],[286,1,288,1],[416,1,417,1],[287,2,292,2],[294,2,299,2],[325,1,327,1],[335,1,337,1],[346,1,347,1],[241,1,242,1],[243,1,244,1],[269,1,270,1],[229,1,230,1],[231,1,232,1],[356,0,357,2],[289,1,291,1],[273,1,274,1],[267,1,268,1],[262,1,263,1],[318,1,319,1],[239,1,240,1],[315,1,316,1],[153,0,153,2],[157,2,160,2],[166,2,168,2],[234,1,236,1],[270,2,275,2],[309,1,310,1],[313,1,314,1],[218,1,219,1],[226,1,227,1],[178,1,179,1],[183,1,184,1],[279,0,279,2],[280,0,280,2],[293,1,294,1],[295,1,296,1],[248,1,249,1],[256,1,257,1],[265,1,266,1],[230,2,233,2],[235,2,236,2],[242,2,245,2],[249,2,250,2],[252,2,255,2],[237,1,238,1],[87,2,89,2],[91,2,92,2],[152,0,152,2],[93,2,95,2],[101,2,104,2],[106,2,109,2],[87,1,89,1],[91,1,92,1],[93,1,94,1],[107,1,108,1],[102,1,103,1],[117,1,118,1],[133,1,134,1],[148,0,148,2],[135,1,138,1],[134,2,138,2],[127,1,128,1],[118,2,119,2],[123,2,125,2],[128,2,132,2],[144,1,147,1],[144,2,147,2],[130,1,131,1],[123,1,124,1],[71,1,72,1],[78,1,79,1],[84,1,85,1],[80,1,81,1],[14,1,15,1],[10,1,12,1],[17,0,17,2],[11,2,12,2],[14,2,16,2],[18,0,18,2],[74,1,75,1],[67,1,68,1],[51,2,58,2],[70,2,73,2],[78,2,82,2],[84,2,85,2],[50,1,51,1],[60,0,60,2],[61,0,61,2],[62,0,65,2],[56,1,57,1],[52,1,55,1],[0,0,0,2],[1,0,1,2],[3,0,3,2],[4,0,4,2],[5,0,5,2],[6,0,6,2],[47,1,48,1],[7,0,8,2],[19,0,20,2],[22,1,23,1],[35,1,36,1],[22,2,26,2],[35,2,36,2],[42,2,49,2],[45,1,46,1],[41,1,44,1],[171,2,174,2],[177,2,180,2],[176,1,177,1],[213,1,214,1],[257,2,258,2],[260,2,264,2],[266,2,268,2],[156,1,157,1],[170,1,171,1],[158,1,159,1],[166,1,167,1],[172,1,173,1],[203,1,204,1],[246,1,247,1],[417,2,418,2],[420,2,423,2],[183,2,185,2],[191,2,195,2],[199,2,202,2],[204,2,208,2],[213,2,214,2],[216,2,220,2],[222,2,223,2],[393,2,395,2],[325,2,328,2],[383,2,384,2],[387,2,389,2],[307,2,311,2],[276,0,276,2],[302,1,303,1],[313,2,317,2],[318,2,319,2],[297,1,298,1],[333,1,334,1],[334,2,338,2],[342,2,343,2],[345,2,348,2],[362,2,367,2],[408,2,413,2],[399,2,402,2],[339,1,340,1],[365,1,366,1],[370,1,371,1],[372,1,373,1],[382,1,383,1],[414,1,415,1],[392,1,393,1],[376,0,376,2],[375,0,375,2],[341,1,342,1],[386,1,387,1],[408,1,409,1],[410,1,412,1],[388,1,389,1],[394,1,395,1],[377,1,378,1],[354,0,355,2],[349,0,349,2],[352,0,352,2],[359,1,360,1],[361,1,364,1],[368,1,369,1]]}
[{"$f":"PartA!C2","v":"Select Facility…"}]
["PART B - RESEARCH PROGRAM QUANTITATIVE DATA"]
[]
["All questions in Part B refer to reporting period June 1, 2021 to May 31, 2022"]
[]
["RESEARCH AND DEVELOPMENT PROGRAM AND R&DC"]
["Note: Questions shaded in yellow are new questions from previous FDC versions."]
["Note: Questions #1-1a are not based on RCO audits and pertain only to events occurring during the current reporting period. These questions may be best addressed by the Research Service."]
[]
[]
["1. ","Number of protocols followed only by the R&DC at any time during this reporting period (e.g., IRB-exempt human subjects protocols; protocols without human, animal, or safety hazards not followed by any research subcommittee):"]
[]
[]
[null,"a.  Number in #1 that were NOT initially approved by the R&DC before research was initiated:"]
[null,"Note: For answers greater than zero for item #1a, provide details in the text box below or provide the ORO case number if previously reported to ORO: "]
[]
[]
[]
["HUMAN RESEARCH PROTECTION PROGRAM"]
["Note: Questions #2-#8 are not based on RCO audits and pertain to research conducted and events occurring during the current reporting period. These questions may be best addressed by the Research Service."]
[]
["2.","Number of human subject protocols active (open) at any time during this reporting period:"]
[null,"Include Million Veteran Program (MVP) and All-of-Us in protocol count. Do not include research activities that are not subject to the Common Rule, such as expanded access protocols."]
[]
[null,"MVP is approved at site."]
[null,"All-of-Us is approved at site."]
["3. ","Number of protocols in #2:"]
[null,"a.  That were exempt from IRB oversight:"]
[null,"b.  That were nonexempt from IRB oversight:"]
[null,"Note: Items 3a + 3b should equal item #2."]
{"$rows_left_out":396}
{"sheet":"Director Attestation","index":2,"n_rows":16,"n_cols":1,"rows_kept":16,"cut":false,"hidden":false,"merged":[[12,0,12,9],[13,0,13,9],[14,0,14,9],[15,0,15,9],[1,0,1,9],[0,0,0,9],[2,0,2,2],[3,0,4,9],[6,0,7,9],[9,0,9,3],[9,4,9,9]]}
[{"$f":"PartA!C2","v":"Select Facility…"}]
["Facility Director Attestation"]
[]
["I acknowledge that I am the Director of this VHA Facility and the Institutional Official responsible for this Facility’s compliance with all federal, VA, and VHA research requirements.  "]
[]
[]
["By submitting this document, I certify that the information contained in this document is accurate to the best of my knowledge."]
[]
[]
["Signature of the Medical Facility Director:"]
[]
[]
["Complete the following steps to submit this Certification:"]
["1. Enter your name in the \"Signature of the Medical Facility Director\" text box above."]
["2. Save the file by clicking the \"Save File\" button below."]
["3. Email the file using the \"Email File\" button below."]

{"sheet":"FDC Instructions","index":3,"n_rows":61,"n_cols":1,"rows_kept":61,"cut":false,"hidden":false,"merged":[[59,0,59,9],[60,0,60,9],[46,0,49,9],[50,0,51,9],[54,0,55,9],[56,0,58,9],[36,0,36,9],[45,0,45,9],[32,0,33,9],[37,0,38,9],[39,0,40,9],[41,0,42,9],[43,0,44,9],[20,0,21,9],[22,0,23,9],[24,0,25,9],[26,0,27,9],[28,0,31,9],[1,0,2,9],[3,0,5,9],[7,0,8,9],[11,0,13,9],[18,0,19,9],[6,0,6,9],[9,0,9,9],[10,0,10,9],[14,0,14,9],[17,0,17,9]]}
["GENERAL INSTRUCTIONS"]
["1. The 2022 Facility Director’s Certification of Research Oversight (FDC) must be completed and submitted in MS Excel format.  "]
[]
["2. The tool must be saved as a macro-enabled workbook (.xlsm) so that all functions in the tool work as intended. The tool has built-in logic that will hide or gray out certain questions and rows depending on the answers to other questions. "]
[]
[]
["3. Include your facility's name in the file name of the saved document."]
["4. Do not separate individual Worksheets from the overall Workbook for completion. The tool must remain as a single Workbook so that all functions work as intended. "]
[]
["5. The tab key can be used to navigate through the items requiring a response on each Worksheet. "]
["6. Do not include any identifiable information, such as subject or investigator names, in the tool."]
["7. To print a copy of the tool, highlight the Worksheets that you could like to print by pressing Ctrl and clicking on the Worksheet tab. Under print options, ensure \"Print Active Sheets\" is selected. You can also choose to \"Print the Entire Workbook.\""]
[]
[]
["8. Any questions related to the 2022 FDC should be sent to OROIDA@va.gov."]
[]
["PART A"]
["1. Only the designated dropdowns and text boxes can be used to respond."]
["2. For dropdowns, click in the light green box and the dropdown arrow will become visible. Select the appropriate response from the options shown. "]
[]
["3. Text boxes will appear bright yellow when a response is required based on the selection in the drop-down menu. The text box will turn white once the required response has been entered."]
[]
["4. To enter information into a text box, click in the box and begin typing a response. The shading will disappear once a response is entered. To paste text into the text box, double click on the text box first. "]
[]
["5. Throughout the tool, the red font text provides additional clarification or asks for additional information. The blue font text helps you navigate to the next applicable question.  "]
[]
["6. Some rows with questions that are not applicable to your site (based on prior responses) will become hidden. The blue font instructions will help guide you to the next applicable question. "]
[]
["7. Designated text boxes are available at the end of each section for any additional notes you would like to provide to ORO or to further explain any answers indicating outstanding noncompliance.  All notes sections will expand as you type in text. If you want to paste text into any of the tan text boxes, double click on the text box first. "]
[]
{"$rows_left_out":32}
{"sheet":"ExportA","index":4,"n_rows":219,"n_cols":6,"rows_kept":219,"cut":false,"hidden":true,"merged":[]}
["Question#","QuestionText","id-facility","id-question","FDCdate","FDCresult"]
["1","Adequate Resources",{"$f":"LEFT(PartA!C2,FIND(\" \",PartA!C2,1)-1)","v":"Select"},"FD2","2022-07-31",{"$f":"PartA!B14","v":"Select…"}]
["1_detail","DETAILS Adequate Resources",{"$f":"C2","v":"Select"},"FD20","2022-07-31",{"$f":"IF(PartA!C18=\"\",\"\",PartA!C18)","v":""}]
["2a","R&DC Appointed in Writing",{"$f":"C3","v":"Select"},"FD9","2022-07-31",{"$f":"PartA!B21","v":"Select…"}]
["2b","Delegated Roles","Select","FD1","2022-07-31",{"$f":"PartA!B23","v":"Select…"}]
["3a","RCO Audit Plan","Select","FD6","2022-07-31",{"$f":"PartA!B27","v":"Select…"}]
["3b","Audits Completed","Select","FD7","2022-07-31",{"$f":"PartA!$B$30","v":"Select…"}]
["3b_detail","DETAILS Audits Not Completed","Select","FD11","2022-07-31",{"$f":"IF(PartA!C33=\"\",\"\",PartA!C33)","v":""}]
["4","Any Acting Position(s)","Select","FD3","2022-07-31",{"$f":"PartA!B34","v":"Select…"}]
["4_acting_detail","DETAILS Acting Positions","Select","FD21","2022-07-31",{"$f":"IF(PartA!C43=\"\",\"\",PartA!C43)","v":""}]
["4_FD","Acting Facility Director","Select","FD12","2022-07-31",false]
["4_ACOS","Acting ACOS/Research or Coordinator","Select","FD14","2022-07-31",false]
["4_AO","Acting Administrative Officer/Research","Select","FD15","2022-07-31",false]
["4_RCO","Acting Research Compliance Officer","Select","FD16","2022-07-31",false]
["4_CC","Acting Research Committee Coordinator(s)","Select","FD17","2022-07-31",false]
["4_CC_detail","Acting Committee Coordinator details","Select","FD18","2022-07-31",{"$f":"IF(PartA!C41=\"\",\"\",PartA!C41)","v":""}]
["4a","CRADO Approval for Acting ACOS/R","Select","FD22","2022-07-31",{"$f":"PartA!B44","v":"Select…"}]
["FDNotes","Facility Director Section Notes","Select","FD8","2022-07-31",{"$f":"IF(PartA!C49=\"\",\"\",PartA!C49)","v":""}]
["5","Another VA R&DC","Select","RD29","2022-07-31",{"$f":"PartA!B52","v":"Select…"}]
["5_detail","DETAILS Another VA R&DC","Select","RD30","2022-07-31",{"$f":"IF(PartA!C53=\"\",\"\",PartA!C53)","v":""}]
["6a","Committees Reviewed Annually, Reported to FD","Select","RD18","2022-07-31",{"$f":"PartA!B56","v":"Select…"}]
["6b","Subcommittee Minutes Review within 60 Days","Select","RD19","2022-07-31",{"$f":"PartA!B59","v":"Select…"}]
["6c","Subcommittee Approval before R&DC Approval","Select","RD20","2022-07-31",{"$f":"PartA!B62","v":"Select…"}]
["6d","External IRB Meets Requirements","Select","RD21","2022-07-31",{"$f":"PartA!B65","v":"Select…"}]
["6e","Approval of Research Not Assigned to Committees","Select","RD22","2022-07-31",{"$f":"PartA!B70","v":"Select…"}]
["6f","Only VA Research for Collaborative Studies","Select","RD23","2022-07-31",{"$f":"PartA!B73","v":"Select…"}]
["6g","Approval for Recruitment of Non-Veterans","Select","RD24","2022-07-31",{"$f":"PartA!B75","v":"Select…"}]
["6h","ISSO and PO review","Select","RD36","2022-07-31",{"$f":"PartA!B77","v":"Select…"}]
["7","Privacy Review Checklist and ERDSP","Select","RD31","2022-07-31",{"$f":"PartA!B81","v":"Select…"}]
["8a","ACOS Notification to PI","Select","RD16","2022-07-31",{"$f":"PartA!B86","v":"Select…"}]
{"$rows_left_out":190}
{"sheet":"ExportB","index":5,"n_rows":169,"n_cols":8,"rows_kept":169,"cut":false,"hidden":true,"merged":[]}
["Question#","QuestionText","id-facility","id-question","ROC_QuestionKey","FDCdate","FDCresult","FDCcomment"]
["1","Total number of protocols followed by the R&DC only",{"$f":"LEFT(PartA!C2,FIND(\" \",PartA!C2,1)-1)","v":"Select"},1,"R1","2022-07-31",{"$f":"IF(PartB!C11=\"\",\"\",PartB!C11)","v":""}]
["1a","Protocols initiated prior to R&DC approval",{"$f":"C2","v":"Select"},2,"R2","2022-07-31",{"$f":"IF(PartB!C14=\"\",\"\",PartB!C14)","v":""}]
["1aDetails","DETAILS Protocols initiated prior to R&DC approval",{"$f":"C3","v":"Select"},147,"R5","2022-07-31",null,{"$f":"IF(PartB!B17=\"\",\"\",PartB!B17)","v":""}]
["2","Active human protocols","Select",5,"H1","2022-07-31",{"$f":"IF(PartB!C22=\"\",\"\",PartB!C22)","v":""}]
["MVP","DETAILS MVP active at site","Select",155,"H82","2022-07-31",null,false]
["AllOfUs","DETAILS All of Us active at site","Select",187,"H123","2022-07-31",null,false]
["3a","IRB-exempt human subjects protocols","Select",6,"H2","2022-07-31",{"$f":"IF(PartB!C28=\"\",\"\",PartB!C28)","v":""}]
["3b","Non-exempt human subjects protocols","Select",7,"H3","2022-07-31",{"$f":"IF(PartB!C29=\"\",\"\",PartB!C29)","v":""}]
["4","Greater than minimal risk protocols","Select",129,"H72","2022-07-31",{"$f":"IF(PartB!C31=\"\",\"\",PartB!C31)","v":""}]
["5a","Protocols with waivers of informed consent per 38CFR16.116","Select",9,"H5","2022-07-31",{"$f":"IF(PartB!C33=\"\",\"\",PartB!C33)","v":""}]
["5b","Protocols with waiver of documentation of informed consent per 38CFR16.117(c)","Select",8,"H4","2022-07-31",{"$f":"IF(PartB!C35=\"\",\"\",PartB!C35)","v":""}]
["6a","Protocols subject to 2018 Common Rule","Select",249,"H146","2022-07-31",{"$f":"IF(PartB!C39=\"\",\"\",PartB!C39)","v":""}]
["6b","Protocols subject to Pre-2018 Common Rule","Select",250,"H147","2022-07-31",{"$f":"IF(PartB!C40=\"\",\"\",PartB!C40)","v":""}]
["7","Protocols suspended/terminated early by IRB","Select",212,"H124","2022-07-31",{"$f":"IF(PartB!C42=\"\",\"\",PartB!C42)","v":""}]
["7Details","DETAILS Protocols suspended or terminated (Human)","Select",150,"H78","2022-07-31",null,{"$f":"IF(PartB!B50=\"\",\"\",PartB!B50)","v":""}]
["8","Number of serious or continuing noncompliance events (Human)","Select",110,"H64","2022-07-31",{"$f":"IF(PartB!C51=\"\",\"\",PartB!C51)","v":""}]
["8Details","DETAILS Serious/continuing noncompliance events (Human)","Select",151,"H79","2022-07-31",null,{"$f":"IF(PartB!B59=\"\",\"\",PartB!B59)","v":""}]
["9","Total number of human protocols receiving an IC audit","Select",12,"H8","2022-07-31",{"$f":"IF(PartB!C67=\"\",\"\",PartB!C67)","v":""}]
["10Calculated","Protocols not receiving IC audit","Select",251,"H148","2022-07-31",{"$f":"IF(PartB!C68=\"\",\"\",PartB!C68)","v":0}]
["10a","Protocols that should have received IC audit AND did not","Select",252,"H149","2022-07-31",{"$f":"IF(PartB!C70=\"\",\"\",PartB!C70)","v":""}]
["10aDetails","DETAILS Protocols that should have received IC audit AND did not","Select",253,"H150","2022-07-31",null,{"$f":"IF(PartB!B74=\"\",\"\",PartB!B74)","v":""}]
["11","Protocols requiring IRB continuing review (IC audit)","Select",13,"H9","2022-07-31",{"$f":"IF(PartB!C75=\"\",\"\",PartB!C75)","v":""}]
["11a","Protocols with lapse in continuing review (IC audit)","Select",14,"H10","2022-07-31",{"$f":"IF(PartB!C77=\"\",\"\",PartB!C77)","v":""}]
["11b","Protocols with activity during lapse (IC audit)","Select",15,"H11","2022-07-31",{"$f":"IF(PartB!C78=\"\",\"\",PartB!C78)","v":""}]
["11bDetails","DETAILS Protocols with activity during lapse (IC audit)","Select",154,"H81","2022-07-31",null,{"$f":"IF(PartB!B83=\"\",\"\",PartB!B83)","v":""}]
["12","Total number of ICDs audited","Select",16,"H12","2022-07-31",{"$f":"IF(PartB!C84=\"\",\"\",PartB!C84)","v":""}]
["12a","ICDs with zero deficiency","Select",17,"H13","2022-07-31",{"$f":"IF(PartB!C87=\"\",\"\",PartB!C87)","v":""}]
["12b","Missing informed consent documents","Select",18,"H14","2022-07-31",{"$f":"IF(PartB!C91=\"\",\"\",PartB!C91)","v":""}]
["12bDetails","DETAILS Missing informed consent documents","Select",156,"H83","2022-07-31",null,{"$f":"IF(PartB!B96=\"\",\"\",PartB!B96)","v":""}]
{"$rows_left_out":140}
{"sheet":"Drop-down","index":6,"n_rows":111,"n_cols":24,"rows_kept":111,"cut":false,"hidden":true,"merged":[]}
["VISN","Facility #","Facility","Select Facility…",null,"Select…",null,"Select…",null,"Select…",null,"Select…",null,"Select…",null,"Select…",null,"Select…",null,"Select…",null,"Select…",null,"Select…"]
[1,402,"VA Maine Healthcare System - Togus","402 VA Maine Healthcare System - Togus",null,"Yes",null,"Yes",null,"Continued full accreditation",null,"Only at the VA animal facility",null,"Full-time",null,"A full-time VA employed veterinarian",null,"The VA IACUC performs the program review and facility inspection of the VA animal program.",null,"The VA IACUC performs its own program review and facility inspection of the affiliate(s) animal program.",null,0,null,"The IBC is a separate committee from the SRS. "]
[1,405,"White River Junction VA Medical Center","405 White River Junction VA Medical Center",null,"No",null,"No",null,"Conditional accreditation",null,"Only at the affiliate animal facility",null,"Part-time",null,"A part-time VA employed veterinarian",null,"The affiliate IACUC-of-record (i.e., no VA IACUC) performs the program review and facility inspection of the VA animal program.",null,"The VA IACUC accepts the semiannual reports of the affiliate IACUC (in lieu of performing its own facility inspection and program review) as a business item during a convened meeting.",null,"1--5",null,"The SRS is constituted as an IBC, and convenes as an IBC/SRS (a single set of minutes are produced)."]
[23,437,"Fargo VA Health Care System","437 Fargo VA Health Care System",null,"N/A",null,null,null,"Deferred accreditation",null,"Both at the VA and affiliate animal facility",null,null,null,"A full-time contracted veterinarian",null,null,null,null,null,"6--10",null,"The SRS is constituted as an IBC, but separate IBC and SRS meetings are convened (two sets of minutes are produced)."]
[23,438,"Sioux Falls VA Health Care System","438 Sioux Falls VA Health Care System",null,null,null,null,null,"Probation",null,null,null,null,null,"A part-time contracted veterinarian",null,null,null,null,null,"11--15"]
[21,459,"VA Pacific Islands Health Care System","459 VA Pacific Islands Health Care System",null,null,null,null,null,"Revoked accreditation",null,null,null,null,null,null,null,null,null,null,null,"16--20"]
[4,460,"Wilmington VA Medical Center","460 Wilmington VA Medical Center",null,null,null,null,null,null,null,null,null,null,null,null,null,null,null,null,null,"> 20"]
[22,501,"New Mexico VA Health Care System","501 New Mexico VA Health Care System"]
[10,506,"VA Ann Arbor Healthcare System","506 VA Ann Arbor Healthcare System"]
[7,508,"Atlanta VA Medical Center","508 Atlanta VA Medical Center"]
[7,509,"Charlie Norwood VA Medical Center","509 Charlie Norwood VA Medical Center"]
[5,512,"VA Maryland Health Care System","512 VA Maryland Health Care System"]
[10,515,"Battle Creek VA Medical Center","515 Battle Creek VA Medical Center"]
[8,516,"Bay Pines VA Healthcare System","516 Bay Pines VA Healthcare System"]
[1,518,"Edith Nourse Rogers Memorial VA Hospital","518 Edith Nourse Rogers Memorial VA Hospital"]
[16,520,"Gulf Coast Veterans Health Care System","520 Gulf Coast Veterans Health Care System"]
[7,521,"Birmingham VA Medical Center","521 Birmingham VA Medical Center"]
[1,523,"VA Boston Healthcare System","523 VA Boston Healthcare System"]
[2,526,"James J. Peters VA Medical Center","526 James J. Peters VA Medical Center"]
[2,528,"VA Western New York Healthcare System","528 VA Western New York Healthcare System"]
[2,"528A6","VA Finger Lakes Healthcare System","528A6 VA Finger Lakes Healthcare System"]
[2,"528A7","Syracuse VA Medical Center","528A7 Syracuse VA Medical Center"]
[2,"528A8","Albany VA Medical Center: Samuel S. Stratton","528A8 Albany VA Medical Center: Samuel S. Stratton"]
[20,531,"Boise VA Medical Center","531 Boise VA Medical Center"]
[7,534,"Ralph H. Johnson VA Medical Center","534 Ralph H. Johnson VA Medical Center"]
[12,537,"Jesse Brown VA Medical Center","537 Jesse Brown VA Medical Center"]
[10,538,"Chillicothe VA Medical Center","538 Chillicothe VA Medical Center"]
[10,539,"Cincinnati VA Medical Center","539 Cincinnati VA Medical Center"]
[5,540,"Louis A. Johnson VA Medical Center","540 Louis A. Johnson VA Medical Center"]
[10,541,"VA Northeast Ohio Healthcare System","541 VA Northeast Ohio Healthcare System"]
{"$rows_left_out":81}